JavaShuo
欄目
標籤
k8s安裝報錯 Error: unknown flag: --experimental-upload-certs 相關文章
原文信息 :
k8s安裝報錯 Error: unknown flag: --experimental-upload-certs
標籤
k8s
安裝
報錯
error
unknown
flag
experimental
upload
certs
全部
unknown
flag
error
錯報
報錯
安裝
k8s
1.flag
項目報錯
報錯記錄
Hibernate教程
Redis教程
PHP 7 新特性
更多相關搜索:
搜索
Dockerfile HEALTHCHECK 報錯 Unknown flag: start-period
2021-01-14
Dockerfile HEALTHCHECK 報錯 Unknown f
Docker
k8s報錯x509: certificate signed by unknown authority
2021-07-14
docker
linux
java
mac
centos
Docker
MySQL 報錯誤:ERROR 1054 (42S22): Unknown error 1054
2021-07-11
MySQL
關於mac安裝rails報錯clang: error: unknown argument
2019-11-24
關於
mac
安裝
rails
報錯
clang
error
unknown
argument
MacBook
gulp安裝報錯Local version: Unknown
2019-11-20
gulp
安裝
報錯
local
version
unknown
JavaScript
Eclipse-Pom文件報錯Unknown error
2019-12-05
eclipse
pom
文件
報錯
unknown
error
Eclipse
Python報錯:Message: unknown error: call function result missing
2020-07-20
python
報錯
message
unknown
error
function
result
missing
Python
vivado報錯 syntax error、dout is an unknown type
2020-12-21
FPGA/DSP改BUG記錄
報錯:selenium.common.exceptions.WebDriverException: Message: unknown error: cannot find Chrome binary
2021-01-05
selenium
自動化測試
python
Chrome
WAMP 中phpmyadmin #2002 - Unknown error while connecting 報錯
2021-07-12
PHP
erlang安裝報錯
2019-12-12
erlang
安裝
報錯
mesos-master啓動失敗,報錯Failed to load unknown flag 'quorum.rpmsave'
2019-12-10
mesos
master
啓動
失敗
報錯
failed
load
unknown
flag
quorum.rpmsave
quorum
rpmsave
Apache
Uncaught Error: Syntax error, unrecognized expression: [flag=]報錯處理方法
2019-12-09
uncaught
error
syntax
unrecognized
expression
flag
報錯
處理
方法
安卓安裝APK報錯error: INSTALL_FAILED_UPDATE_INCOMPATIBLE
2019-11-13
安裝
apk
報錯
error
install
failed
update
incompatible
Android
安裝gcc 報錯
2019-12-07
安裝
gcc
報錯
GCC
安卓預覽報錯 Failed to load AppCompat ActionBar with unknown error
2019-11-24
預覽
報錯
failed
load
appcompat
actionbar
unknown
error
Android
k8s--報錯
2020-11-10
node
nginx
json
bootstrap
api
bash
app
ide
rest
Nginx
Ubuntu pip3安裝uwsgi報錯
2019-12-13
ubuntu
pip3
pip
安裝
uwsgi
報錯
Ubuntu
k8s安裝dashboard
2020-06-24
k8s
安裝
dashboard
Mac升級10.5.5後,Pycharm報錯unKnown error,重新安裝後可以使用
2021-07-12
MacBook
Appium-desktop安裝啓用Inspector一直報錯An unknown server-side error occurred...
2019-11-11
appium
desktop
安裝
啓用
inspector
一直
報錯
unknown
server
error
occurred
小米4安裝apk時報錯:Unknown failure (Failure - not installed for 0) Error while Installing APKs
2021-07-14
session
小米
apk
app
手機
Android
centOS 安裝 docker 報錯
2021-01-05
linux
docker
CentOS
安裝libspatiaLite報錯,error: 'libsqlite3' is required
2020-05-12
安裝
libspatialite
報錯
error
libsqlite3
libsqlite
required
SQL Server安裝報錯 Error code 0x858C001B
2021-01-17
SQL
安裝 MYSQL ODBC 報錯(Error 1918)
2020-05-29
安裝
mysql
odbc
報錯
error
MySQL
wordpress安裝報錯WordPress database error: [Binary log
2021-07-14
Wordpress
windows10下安裝docker報錯:error during connect
2019-11-10
windows10
windows
安裝
docker
報錯
error
connect
Windows
ArcGIS安裝時報錯:「Error 1935」
2021-01-07
更多相關搜索:
搜索
每日一句
每一个你不满意的现在,都有一个你没有努力的曾经。
最新文章
1.
【Java8新特性_尚硅谷】P1_P5
2.
SpringSecurity 基礎應用
3.
SlowFast Networks for Video Recognition
4.
074-enable-right-click
5.
WindowFocusListener窗體焦點監聽器
6.
DNS部署(二)DNS的解析(正向、反向、雙向、郵件解析及域名轉換)
7.
Java基礎(十九)集合(1)集合中主要接口和實現類
8.
瀏覽器工作原理學習筆記
9.
chrome瀏覽器構架學習筆記
10.
eclipse引用sun.misc開頭的類
相关标签
unknown
flag
error
錯報
報錯
安裝
k8s
1.flag
項目報錯
報錯記錄
本站公眾號
歡迎關注本站公眾號,獲取更多信息