JavaShuo
欄目
標籤
運行maven install命令時出現錯誤(BUILD FAILURE) 相關文章
原文信息 :
運行maven install命令時出現錯誤(BUILD FAILURE)
標籤
運行
maven
install
命令
出現
錯誤
build
failure
欄目
Maven
全部
運行時錯誤
運行錯誤
failure
install
命令行CMD
命令行
Linux命令行
錯誤
運行時
build
Maven
Docker命令大全
Maven教程
PHP 7 新特性
命令
更多相關搜索:
搜索
maven 執行命令mvn help:system命令時報build failure錯誤
2021-07-12
maven
java
Maven
在使用eclipse 運行 maven install的時候,出現錯誤:
2019-11-06
在使
eclipse
運行
maven
install
時候
出現
錯誤
Eclipse
eclipse 運行 maven install的時候,出現這個錯誤:ERROR: Unable
2021-07-12
Eclipse
maven進行install時出現Fatal error compiling錯誤
2020-12-21
maven
Maven
Maven運行錯誤
2021-01-22
Maven
Maven
myeclipse運行maven install命令跳過test
2020-12-29
maven test
Eclipse
maven執行install命令報錯
2020-12-20
maven執行install命令報錯
Failed to execute go
The packaging for th
Maven
使用maven時出現failure to transfer錯誤,下載jar慢
2021-01-02
eclipse
maven
ide
this
阿里雲
url
spa
xml
Maven
使用maven時出現Failure to transfer 錯誤的解決方法
2020-05-11
使用
maven
出現
failure
transfer
錯誤
解決
方法
Maven
Maven--Build Failure
2019-12-07
maven
build
failure
Maven
關於npm install 命令運行報錯
2020-12-27
npm install 運行報錯
ifdown 命令出現錯誤
2019-11-19
ifdown
命令
出現
錯誤
eval_ssd_netbook.py運行時出現的錯誤。
2021-01-21
存儲
Maven Build、Clean、Install指令
2019-11-06
maven
build
clean
install
指令
Maven
運行Maven項目時出現invalid LOC header (bad signature)錯誤
2021-01-07
Maven
IDEA工具運行Maven命令時控制檯出現亂碼
2020-12-29
Eclipse
Maven項目----------主項目無法install,並出現error錯誤時
2021-07-12
Maven
install
主項目
Maven
Maven Install出錯!!
2020-12-23
出錯BUG
Maven
Hadoop,hive啓動,執行命令時出現的錯誤總結
2021-01-04
Hadoop
Maven執行install命令出現Exception in thread "main" java.lang.StackOverflowError
2019-11-15
maven
執行
install
命令
出現
exception
thread
main
java.lang.stackoverflowerror
java
lang
stackoverflowerror
Maven
在Linux系統裏運行shutdown.sh命令關閉Tomcat時出現錯誤提示
2019-11-09
linux
系統
運行
shutdown.sh
shutdown
命令
關閉
tomcat
出現
錯誤
提示
Linux
sudo命令:解決使用Linux命令行時出現的錯誤提示
2019-11-12
sudo
命令
解決
使用
linux
行時
出現
錯誤
提示
Linux
Maven clean失敗(報錯[INFO] BUILD FAILURE )
2020-12-21
Maven
maven項目出現如下錯誤Could not calculate build plan
2020-12-28
問題解決
Maven
運行maven出現Error:java: 錯誤: 不支持發行版本 5
2020-12-27
java
Maven
運行maven時出現Error:java:錯誤不支持發行版本5
2021-07-12
Maven
Node.js執行npm install命令時出現的問題
2021-05-15
數據庫
Node.js
更多相關搜索:
搜索
每日一句
每一个你不满意的现在,都有一个你没有努力的曾经。
最新文章
1.
Duang!超快Wi-Fi來襲
2.
機器學習-補充03 神經網絡之**函數(Activation Function)
3.
git上開源maven項目部署 多module maven項目(多module maven+redis+tomcat+mysql)後臺部署流程學習記錄
4.
ecliple-tomcat部署maven項目方式之一
5.
eclipse新導入的項目經常可以看到「XX cannot be resolved to a type」的報錯信息
6.
Spark RDD的依賴於DAG的工作原理
7.
VMware安裝CentOS-8教程詳解
8.
YDOOK:Java 項目 Spring 項目導入基本四大 jar 包 導入依賴,怎樣在 IDEA 的項目結構中導入 jar 包 導入依賴
9.
簡單方法使得putty(windows10上)可以免密登錄樹莓派
10.
idea怎麼用本地maven
相关标签
運行時錯誤
運行錯誤
failure
install
命令行CMD
命令行
Linux命令行
錯誤
運行時
build
Maven
本站公眾號
歡迎關注本站公眾號,獲取更多信息