JavaShuo
欄目
標籤
go 中gcc 編譯問題(gcc.exe fatal error no input files compilation terminated) 相關文章
原文信息 :
go 中gcc 編譯問題(gcc.exe fatal error no input files compilation terminated)
標籤
gcc
編譯
問題
gcc.exe
exe
fatal
error
input
files
compilation
terminated
欄目
GCC
全部
Android編譯error
fatal
compilation
files
terminated
gcc.exe
input
error
gcc
編譯
GCC
NoSQL教程
PHP教程
MySQL教程
註冊中心
更多相關搜索:
搜索
go 中gcc 編譯問題(gcc.exe fatal error no input files compilation terminated)
2021-01-02
GCC
QT :-1: error: fatal error: no input files
2020-12-24
Qt-lalala
Go語言的cgo時用到的GCC編譯器
2021-07-11
GCC
ev.h: No such file or directory compilation terminated.
2020-01-30
ev.h
file
directory
compilation
terminated
gcc 編譯問題
2019-11-17
gcc
編譯
問題
GCC
vscode下使用coder runner插件編譯報錯:No such file or directory fatal error: no input files
2021-07-12
遇到的錯誤
編譯內核中可能出空間不足的問題 (No space left on device)
2020-05-25
編譯
內核
可能
出空
不足
問題
space
left
device
SQL
gcc編譯問題
2019-11-21
gcc
編譯
問題
GCC
gcc 6.0編譯opencv出錯
2019-11-07
gcc
6.0
編譯
opencv
出錯
GCC
fdfs_client/sendfilemodule.c:43:20: fatal error: Python.h: 沒有那個文件或目錄 compilation terminated. er
2020-08-07
fdfs
client
sendfilemodule.c
sendfilemodule
fatal
error
python.h
python
沒有
那個
文件
目錄
compilation
terminated
C&C++
fatal error: EGL/egl.h: No such file or directory
2019-12-11
fatal
error
egl
egl.h
file
directory
編譯windows程序遇到fatal error C1189 #error No Target Architecture
2021-07-14
windows
c語言
visual studio
Windows
全志TinaLinux編譯錯誤fatal error: unicode/ucnv.h: No such file or directory
2019-12-02
tinalinux
編譯
錯誤
fatal
error
unicode
ucnv.h
ucnv
file
directory
字符編碼
fatal error: sys/videoio.h: No such file or directory
2021-02-17
ide
spa
prototype
code
orm
get
微服務
fatal error: openssl/opensslv.h: No such file or directory
2020-07-26
fatal
error
openssl
opensslv.h
opensslv
file
directory
SSL
配置內核編譯前,make menuconfig後報錯fatal error: curses.h: No such file or directory
2020-01-14
配置
內核
編譯
make
menuconfig
報錯
fatal
error
curses.h
curses
file
directory
src/primemodule.c:2:10: fatal error: openssl/conf.h: No such file or directory
2020-08-02
src
primemodule.c
primemodule
fatal
error
openssl
conf.h
conf
file
directory
C&C++
Error compiling OpenCV, fatal error: stdlib.h: No such file or directory
2020-01-30
error
compiling
opencv
fatal
stdlib.h
stdlib
file
directory
BUG:給Nexus7編譯Android4.2的時候出現 fatal error: map: No such file or directory
2019-11-18
bug
nexus7
nexus
編譯
android4.2
android
時候
出現
fatal
error
map
file
directory
Android
關於安裝MySQLdb出現fatal error: my_config.h: No such file or directory
2020-07-26
關於
安裝
mysqldb
出現
fatal
error
config.h
config
file
directory
MySQL
「 fatal error: openssl/ssl.h: No such file or directory 「錯誤解決
2020-01-30
fatal
error
openssl
ssl.h
ssl
file
directory
錯誤
解決
SSL
Compilation Error
2021-07-10
fatal error: gnu/stubs-32.h: No such file
2019-11-11
fatal
error
gnu
stubs
32.h
file
linux 內核編譯 錯誤 fatal error: linux/compiler-gcc6.h: No such file or directory
2020-01-26
linux
內核
編譯
錯誤
fatal
error
compiler
gcc6.h
gcc
file
directory
Linux
Android Studio編譯問題: Compilation error. See log for more details
2021-01-03
debug
java
android studio
android
Android
iOS 報錯 clang: error: no input files ~解決bug
2021-08-15
ios
bug
clang
解決
報錯
iOS
compilation與編譯
2019-11-06
compilation
編譯
【Tools】 VSCode Debug 報 g++.exe No such file or directory fatal error no input files.. 的解決方案
2021-01-02
更多相關搜索:
搜索
每日一句
每一个你不满意的现在,都有一个你没有努力的曾经。
最新文章
1.
windows下配置opencv
2.
HED神經網
3.
win 10+ annaconda+opencv
4.
ORB-SLAM3系列-多地圖管理
5.
opencv報錯——(mtype == CV_8U || mtype == CV_8S)
6.
OpenCV計算機視覺學習(9)——圖像直方圖 & 直方圖均衡化
7.
【超詳細】深度學習原理與算法第1篇---前饋神經網絡,感知機,BP神經網絡
8.
Python數據預處理
9.
ArcGIS網絡概述
10.
數據清洗(三)------檢查數據邏輯錯誤
相关标签
Android編譯error
fatal
compilation
files
terminated
gcc.exe
input
error
gcc
編譯
GCC
本站公眾號
歡迎關注本站公眾號,獲取更多信息