JavaShuo
欄目
標籤
異常:ApkProvisionException: No outputs for the main artifact of variant: debug 相關文章
原文信息 :
異常:ApkProvisionException: No outputs for the main artifact of variant: debug
標籤
Android
計算機
欄目
Android
全部
for...of
for..of
variant
main
outputs
artifact
異常
常見異常
debug
Mybatis異常
Android
PHP 7 新特性
PHP教程
NoSQL教程
更多相關搜索:
搜索
ApkProvisionException: No outputs for the main artifact of variant: debug
2021-05-23
開發中遇到的問題
android
java
Android 異常
ApkProvision
Android
Android異常:ApkProvisionException: No outputs for the main artifact of variant: debug
2021-01-13
安卓
Android
No outputs for the main artifact of variant: debug
2021-01-07
Android
Android
Unable to determine application id: com.android.tools.idea.run.ApkProvisionException: No outputs for
2021-07-11
android初級
Android
dubbo異常:Failed to check the status of the service . No provider available for the service 解決
2019-12-05
dubbo
異常
failed
check
status
service
provider
available
解決
Dubbo
異常:no main manifest attribute
2020-03-23
異常
main
manifest
attribute
Maven異常:Could not find artifact
2020-05-12
maven
異常
artifact
Maven
the debug of Test.ipdl demo
2021-01-07
java.lang.IllegalArgumentException: No converter found for return value of type 異常
2020-12-31
json異常處理
Java
mvn package 打包異常:Could not resolve dependencies for project ... Could not find artifact ...
2020-05-11
mvn
package
打包
異常
resolve
dependencies
project
artifact
The packaging for this project did not assign a file to the build artifact,No plugin found for prefi
2021-06-25
Dobbo 2.7.6 Failed to check the status of the service **** No provider available for the service **
2021-07-10
Dubbo
dubbo2.7.6
zookeeper
rpc
java
Dubbo
The Main Interfaces of Java Collections Framework
2019-11-10
main
interfaces
java
collections
framework
Java
170524、java.lang.IllegalArgumentException: No converter found for return value of type異常解決
2020-12-31
Java
異常java.lang.NoSuchMethodError: main
2021-01-16
Java
Maven —— No plugin found for prefix 'tomcat7' in the current project(異常記錄)
2021-07-12
maven
Maven
The packaging for this project did not assign a file to the build artifact
2021-07-12
Hibernate異常No row with the given identifier exists
2019-11-21
hibernate
異常
row
given
identifier
exists
Hibernate
(HttpMessageNotWritableException ) No converter found for return value of type xxxx
2019-12-07
httpmessagenotwritableexception
converter
return
value
type
No constructor found matching異常與Cannot read property of null異常
2021-01-09
java
Java
Bug:Unable to determine application id: com.android.tools.idea.run.ApkProvisionException: No outputs
2021-06-19
Studio
Android
maven異常:missing artifact jdk.tools:jar:1.6
2019-11-12
maven
異常
missing
artifact
jdk.tools
jdk
tools
jar
1.6
Maven
variant conversion error for variable:V17
2019-12-06
variant
conversion
error
variable
v17
No provider available for the service
2019-12-04
provider
available
service
更多相關搜索:
搜索
每日一句
每一个你不满意的现在,都有一个你没有努力的曾经。
最新文章
1.
安裝cuda+cuDNN
2.
GitHub的使用說明
3.
phpDocumentor使用教程【安裝PHPDocumentor】
4.
yarn run build報錯Component is not found in path 「npm/taro-ui/dist/weapp/components/rate/index「
5.
精講Haproxy搭建Web集羣
6.
安全測試基礎之MySQL
7.
C/C++編程筆記:C語言中的複雜聲明分析,用實例帶你完全讀懂
8.
Python3教程(1)----搭建Python環境
9.
李宏毅機器學習課程筆記2:Classification、Logistic Regression、Brief Introduction of Deep Learning
10.
阿里雲ECS配置速記
相关标签
for...of
for..of
variant
main
outputs
artifact
異常
常見異常
debug
Mybatis異常
Android
本站公眾號
歡迎關注本站公眾號,獲取更多信息