JavaShuo
欄目
標籤
Failed to execute goal org.mybatis.generator:mybatis-generator-XML Parser Error on line 1: 前言中不允許有內容 相關文章
原文信息 :
Failed to execute goal org.mybatis.generator:mybatis-generator-XML Parser Error on line 1: 前言中不允許有內容
標籤
Java
日常技巧
mybatis
欄目
MyBatis
全部
容許有
goal
execute
不容許
parser
failed
line
容許
中心內容
MyBatis
XML
Java
R 語言教程
Docker教程
Docker命令大全
註冊中心
技術內幕
更多相關搜索:
搜索
輕輕鬆鬆學習SpringBoot2:第八篇: Parser Error on line 1: 前言中不允許有內容
2021-01-05
Spring Boot
Parser Error on li
Parser Error on line 1: 前言中不允許
前言中不允許
Parser Error on line 1:
xml 解析出錯
Spring
org.xml.sax.SAXParseException;lineNumber:1;columnNumber:1;前言中不允許有內容
2021-01-09
BUG
SSM
XML
Message:Message: 前言中不允許有內容
2021-01-18
錯誤
BUILD FAILED D:\build.xml:2: 前言中不允許有內容
2021-01-18
XML
Failed to execute goal org.apache.maven.plugins
2019-11-12
failed
execute
goal
org.apache.maven.plugins
org
apache
maven
plugins
Apache
org.xml.sax.SAXParseException; lineNumber: 1; columnNumber: 1; 前言中不容許有內容。
2020-06-11
org.xml.sax.saxparseexception
org
xml
sax
saxparseexception
linenumber
columnnumber
前言
容許有
內容
XML
[ERROR] Failed to execute goal org.apache.maven.plugins:maven-compiler-plugin:3.8.1:compile
2020-07-19
error
failed
execute
goal
org.apache.maven.plugins
org
apache
maven
plugins
compiler
plugin
3.8.1
compile
Apache
Android studio assets error:前言中不容許有內容
2019-11-25
android
studio
assets
error
前言
容許有
內容
Android
[已解決]IDEA:SpringBoot: [ERROR]Failed to execute goal org.mybatis.generator:
2020-05-22
解決
idea
springboot
error
failed
execute
goal
org.mybatis.generator
org
mybatis
generator
Eclipse
Android studio導入opencv,前言中不允許有內容
2021-01-18
Android
[ERROR] Failed to execute goal org.mybatis.generator:mybatis-generator-maven-plugin......
2020-05-22
error
failed
execute
goal
org.mybatis.generator
org
mybatis
generator
maven
plugin
MyBatis
maven報錯:Failed to execute goal on project
2020-12-25
maven
依賴
Maven
Failed to execute goal on project dubboxdemo-servi
2021-07-12
[ERROR] Failed to execute goal org.apache.maven.plugins:maven-compiler-plugin
2020-12-25
Apache
Failed to execute goal org.apache.maven.plugins:ma
2019-11-15
failed
execute
goal
org.apache.maven.plugins
org
apache
maven
plugins
Apache
[ERROR] Failed to execute goal org.apache.maven.plugins:maven-compiler-plugin:2.3.2:compile
2020-12-25
java\jdk\..\lib\tools.jar
Apache
[ERROR] Failed to execute goal org.apache.maven.plugins:maven-compiler-plugin:3.7.0:compile
2020-12-25
Apache
ERROR: maven + Failed to execute goal on project 錯誤解決思路
2021-07-11
maven
idea
Java
Maven
Mybatis 運行時org.xml.sax.SAXParseException; lineNumber: 1; columnNumber: 1; 前言中不允許有內容
2021-01-16
mybatis
MyBatis
[ERROR] Failed to execute goal on project jdong: Could not resolve dependencies for project jdong:ja
2020-12-25
java
Error
idea
maven
Java
解決Failed to execute goal org.apache.maven.plugins
2020-12-25
Apache
[ERROR] Failed to execute goal on project treasure_core_service: Could not resolve dependencies for
2020-05-11
error
failed
execute
goal
project
treasure
core
service
resolve
dependencies
報錯:前言不容許有內容
2020-10-30
android
緩存
app
maven
gradle
google
.net
xml
blog
Android
Failed to execute goal org.apache.maven.plugins:maven-checkstyle-plugin:2.15:check
2019-12-06
failed
execute
goal
org.apache.maven.plugins
org
apache
maven
plugins
checkstyle
plugin
2.15
check
Apache
maven - Failed to execute goal org.apache.maven
2019-11-18
maven
failed
execute
goal
org.apache.maven
org
apache
Maven
前言中不許有內容
2021-01-18
Failed to execute goal org.apache.maven.plugins:maven-compiler-plugin:3.3:compile
2020-12-25
Apache
錯誤:Failed to execute goal org.apache.tomcat.maven:tomcat7-maven-plugin:2.2
2019-12-06
錯誤
failed
execute
goal
org.apache.tomcat.maven
org
apache
tomcat
maven
tomcat7
plugin
2.2
Apache
更多相關搜索:
搜索
每日一句
每一个你不满意的现在,都有一个你没有努力的曾经。
最新文章
1.
Mud Puddles ( bfs )
2.
ReSIProcate環境搭建
3.
SNAT(IP段)和配置網絡服務、網絡會話
4.
第8章 Linux文件類型及查找命令實踐
5.
AIO介紹(八)
6.
中年轉行互聯網,原動力、計劃、行動(中)
7.
詳解如何讓自己的網站/APP/應用支持IPV6訪問,從域名解析配置到服務器配置詳細步驟完整。
8.
PHP 5 構建系統
9.
不看後悔系列!Rocket MQ 使用排查指南(附網盤鏈接)
10.
如何簡單創建虛擬機(CentoOS 6.10)
相关标签
容許有
goal
execute
不容許
parser
failed
line
容許
中心內容
MyBatis
XML
Java
本站公眾號
歡迎關注本站公眾號,獲取更多信息