JavaShuo
欄目
標籤
android ant Compile failed; see the compiler error 相關文章
原文信息 :
android ant Compile failed; see the compiler error
標籤
android
ant
compile
failed
compiler
error
欄目
Android
全部
See
compile
compiler
failed
error
Android編譯error
ant
jenkins+android+ant
robotium+ant+android
compiler&runtime
自動化構建
Android
更多相關搜索:
搜索
Compile failed; see the compiler error output for details
2020-05-21
compile
failed
compiler
error
output
details
Compile failed: see the compiler error output for details
2020-05-21
compile
failed
compiler
error
output
details
Compile failed; see the compiler error output for details. 解決
2020-05-21
compile
failed
compiler
error
output
details
解決
JAVA -- ant編譯時出現Compile failed; see the compiler error output for details異常
2020-05-21
java
ant
編譯
出現
compile
failed
compiler
error
output
details
異常
Java
Compilation failed; see the compiler error output for details.
2020-05-21
compilation
failed
compiler
error
output
details
Compilation failed; see the compiler error output for details:
2020-05-21
compilation
failed
compiler
error
output
details
Compilation failed; see the compiler error output for details
2020-05-21
compilation
failed
compiler
error
output
details
Error:Compilation failed; see the compiler error output for details.
2020-12-25
android studio
terminal
Android
see the compiler error output for details
2020-05-21
compiler
error
output
details
[ERROR] Failed to execute goal org.apache.maven.plugins:maven-compiler-plugin:3.8.1:compile
2020-07-19
error
failed
execute
goal
org.apache.maven.plugins
org
apache
maven
plugins
compiler
plugin
3.8.1
compile
Apache
Android Realm數據庫:Compilation failed; see the compiler error output for details.
2020-05-21
android
realm
數據庫
compilation
failed
compiler
error
output
details
Android
Android解決app:compileDebugJavaWithJavac>Compilation failed; see the compiler error output for details
2020-05-21
android
解決
app
compiledebugjavawithjavac
compilation
failed
compiler
error
output
details
Android
Android studio運行出錯 compilation failed see the compiler error output for details.
2020-05-21
android
studio
運行
出錯
compilation
failed
compiler
error
output
details
Android
Android Studio Compilation failed; see the compiler error output for details.
2020-05-21
android
studio
compilation
failed
compiler
error
output
details
Android
compilation failed: see the compiler error outpur for details解決方案
2020-05-21
compilation
failed
compiler
error
outpur
details
解決
方案
[ERROR] Failed to execute goal org.apache.maven.plugins:maven-compiler-plugin:2.3.2:compile
2020-12-25
java\jdk\..\lib\tools.jar
Apache
[ERROR] Failed to execute goal org.apache.maven.plugins:maven-compiler-plugin:3.7.0:compile
2020-12-25
Apache
Failed to execute goal org.apache.maven.plugins:maven-compiler-plugin:3.3:compile
2020-12-25
Apache
E:\ant\Ant\build.xml:7: Error starting modern compiler
2020-02-09
ant
build.xml
build
xml
error
starting
modern
compiler
自動化構建
android studio報錯只有Compilation failed; see the compiler error output for details.(未完全弄懂)
2020-12-25
Android
解決Failed to execute goal org.apache.maven.plugins:maven-compiler-plugin:3.1:compile (default-compile
2020-05-10
解決
failed
execute
goal
org.apache.maven.plugins
org
apache
maven
plugins
compiler
plugin
3.1
compile
default
Apache
Failed to execute goal org.apache.maven.plugins:maven-compiler-plugin:2.5.1:compile (default-compile
2019-12-06
failed
execute
goal
org.apache.maven.plugins
org
apache
maven
plugins
compiler
plugin
2.5.1
compile
default
Apache
解決Failed to ... maven-compiler-plugin:3.1:compile (default-compile) on project ...
2021-01-05
Maven
安卓編譯錯誤app:compileDebugJavaWithJavac>Compilation failed; see the compiler error output for details.
2020-05-21
編譯
錯誤
app
compiledebugjavawithjavac
compilation
failed
compiler
error
output
details
Android
更多相關搜索:
搜索
每日一句
每一个你不满意的现在,都有一个你没有努力的曾经。
最新文章
1.
1.2 Illustrator多文檔的幾種排列方式
2.
5.16--java數據類型轉換及雜記
3.
性能指標
4.
(1.2)工廠模式之工廠方法模式
5.
Java記錄 -42- Java Collection
6.
Java記錄 -42- Java Collection
7.
github使用
8.
Android學習筆記(五十):聲明、請求和檢查許可
9.
20180626
10.
服務擴容可能引入的負面問題及解決方法
相关标签
See
compile
compiler
failed
error
Android編譯error
ant
jenkins+android+ant
robotium+ant+android
compiler&runtime
自動化構建
Android
本站公眾號
歡迎關注本站公眾號,獲取更多信息