JavaShuo
欄目
標籤
docker build 報錯:temporary error 相關文章
原文信息 :
docker build 報錯:temporary error
欄目
Docker
全部
temporary
build
error
錯報
報錯
項目報錯
報錯記錄
JSP報錯
MySQL報錯
oracle報錯
Docker
Docker教程
Docker命令大全
PHP 7 新特性
docker
更多相關搜索:
搜索
docker search registry報錯Temporary failure in name
2019-11-09
docker
search
registry
報錯
temporary
failure
Docker
docker build 報錯「docker build「 requires exactly 1 argument. See ‘docker build --help‘.
2021-05-02
錯誤警集
docker
Docker
docker build 時候報錯
2020-12-21
docker
dockerfile
鏡像
nginx
Docker
webpack build報錯
2019-12-04
webpack
build
報錯
apache 報錯 AH01089: search for temporary
2019-11-07
apache
報錯
ah01089
search
temporary
Apache
docker build -t myip .報錯怎麼辦?
2021-07-11
Docker
gitbook build 報錯
2019-11-05
gitbook
build
報錯
Git
ndk-build 編譯報錯 fatal error: error writing to -: Invalid argument } ^
2020-06-28
ndk
build
編譯
報錯
fatal
error
writing
invalid
argument
jenkins xcode build 報錯
2019-12-04
jenkins
xcode
build
報錯
自動化構建
Centos7重啓docker報錯:Error starting daemon: error ini...tatus 2
2021-01-10
Docker
centos
運維
Tomcat
解決Docker的Error response from daemon報錯
2021-01-19
linux
docker
vim
網絡
tcp
ide
學習
測試
.net
code
Docker
windows10下安裝docker報錯:error during connect
2019-11-10
windows10
windows
安裝
docker
報錯
error
connect
Windows
docker build提示error checking context:can't stat xxx
2019-11-06
docker
build
提示
error
checking
context
can't
stat
Docker
activemq啓動錯誤:ERROR | Temporary Store limit is 51200 mb, whilst the temporary data directory
2021-01-13
ActiveMQ
docker pull 報錯
2020-12-25
運維
Docker
解決 docker 報錯: Error starting daemon: error initializing graphdriver: backing file system is unsuppor
2019-11-05
解決
docker
報錯
error
starting
daemon
initializing
graphdriver
backing
file
system
unsuppor
Docker
npm run build報錯問題
2021-07-11
前端積累
build 報錯日誌查看
2020-08-07
build
報錯
日誌
查看
idea build報錯 OutOfMemoryError: insufficient memory
2021-08-15
idea使用手冊
java
Eclipse
npm run dev報錯 Module build failed: Error: Cannot find module 'node-sass'
2020-12-20
Pyinstaller安裝失敗報錯提示Installing build dependencies ... error
2020-12-21
python遇到的小麻煩
python
github
深度學習
Python
webpack報錯:Module build failed (from ./node_modules/babel-loader/lib/index.js): Error: Cannot find mo
2019-11-11
webpack
報錯
module
build
failed
node
modules
babel
loader
lib
index.js
index
error
JavaScript
解決 React-Native mac10.14.4 運行報錯 error Failed to build iOS project
2019-11-17
解決
react
native
mac10.14.4
mac
運行
報錯
error
failed
build
ios
project
React
npm run dev 報錯 Module build failed: Error: Cannot find module 'node-sass'
2019-11-13
npm
run
dev
報錯
module
build
failed
error
node
sass
Maven項目pom文件報錯Project build error: Non-resolvable parent POM for...
2021-01-04
測試之路
Maven
npm 報錯 Module build failed: Error: No PostCSS Config found in:
2021-07-11
web前端
技術
visual studio code
HTML
npm run build報錯:Error: EPERM: operation not permitted, mkdir
2020-07-06
npm
run
build
報錯
error
eperm
operation
permitted
mkdir
更多相關搜索:
搜索
每日一句
每一个你不满意的现在,都有一个你没有努力的曾经。
最新文章
1.
resiprocate 之repro使用
2.
Ubuntu配置Github並且新建倉庫push代碼,從已有倉庫clone代碼,並且push
3.
設計模式9——模板方法模式
4.
avue crud form組件的快速配置使用方法詳細講解
5.
python基礎B
6.
從零開始···將工程上傳到github
7.
Eclipse插件篇
8.
Oracle網絡服務 獨立監聽的配置
9.
php7 fmp模式
10.
第5章 Linux文件及目錄管理命令基礎
相关标签
temporary
build
error
錯報
報錯
項目報錯
報錯記錄
JSP報錯
MySQL報錯
oracle報錯
Docker
本站公眾號
歡迎關注本站公眾號,獲取更多信息