JavaShuo
欄目
標籤
安裝 PHP 7.3.7 出現 make: *** [sapi/cli/php] Error 1 解決辦法彙總 相關文章
原文信息 :
安裝 PHP 7.3.7 出現 make: *** [sapi/cli/php] Error 1 解決辦法彙總
標籤
安裝
php
7.3.7
出現
make
sapi
cli
error
解決辦法
彙總
欄目
PHP
全部
解決辦法
7.3.7
make
安裝PHP
解決方法
現匯
error
總彙
彙總
IE bug 解決辦法
PHP
PHP教程
PHP 7 新特性
PHP參考手冊
PHP
算法
更多相關搜索:
搜索
安裝PHP出現make: *** [sapi/cli/php] Error 1 解決辦法
2019-11-07
安裝
php
出現
make
sapi
cli
error
解決辦法
PHP
編譯php 出現 make: *** [ext/mysqli/mysqli.lo] Error 1 錯誤的解決辦法
2019-11-05
編譯
php
出現
make
ext
mysqli
mysqli.lo
error
錯誤
解決辦法
PHP
php編譯安裝報錯:make: *** [sapi/cli/php] Error 1 解決辦法
2019-12-12
php
編譯
安裝
報錯
make
sapi
cli
error
解決辦法
PHP
php安裝擴展時報錯:make: *** [mbstring.lo] Error 1,解決方案
2020-06-06
php
安裝
擴展
報錯
make
mbstring.lo
mbstring
error
解決
方案
PHP
make[1]: *** [public.mk] Error 1的解決方法
2021-07-12
flang安裝問題與解決辦法彙總
2020-08-04
flang
安裝
問題
解決辦法
彙總
WRTnode-make V=s出錯解決辦法
2021-01-19
SpringBoot 出現Whitelabel Error Page 解決辦法
2019-11-10
springboot
出現
whitelabel
error
page
解決辦法
Spring
安裝GD 完美解決make error
2020-04-10
安裝
完美
解決
make
error
Ubuntu16.04安裝pcl出現cannot find -lvtkproj4解決辦法
2020-08-08
ubuntu16.04
ubuntu
安裝
pcl
出現
lvtkproj4
lvtkproj
解決辦法
Ubuntu
ubuntu16.04安裝NS2出現問題及解決辦法
2021-01-05
Ubuntu
cacti 安裝過程出現的錯誤解決辦法
2021-07-12
PHP程序出現ERR_CONTENT_DECODING_FAILED錯誤,解決辦法總結
2019-12-04
php
程序
出現
err
content
decoding
failed
錯誤
解決辦法
總結
PHP
make: *** No rule to make target解決辦法
2019-12-09
make
rule
target
解決辦法
win10系統出現的問題彙總及解決辦法
2021-01-11
win10
系統環境配置
Windows
安裝compass時出現ERROR: Failed to build gem native extension...... -- mkmf (Load Error)解決辦法
2019-11-10
安裝
compass
出現
error
failed
build
gem
native
extension
mkmf
load
解決辦法
安裝sql server 2005時出現「安裝彙編」錯誤的解決辦法
2019-11-08
安裝
sql
server
2005時
出現
彙編
錯誤
解決辦法
SQL
構建 joy 時解決 make[1]: *** [all-recursive] Error 1 make: *** [all] Error 2 之類問題
2020-08-13
構建
joy
解決
make
recursive
error
之類
問題
CentOS6.5下yum安裝php-mysql出錯解決辦法
2020-12-25
CentOS
perl cpan 安裝 XML::Parser 報 make[1]: *** [Expat.o] Error 1 的解決方法
2019-12-01
perl
cpan
安裝
xml
parser
make
expat.o
expat
error
解決
方法
Perl
go get國內解決辦法彙總
2021-01-17
【python】安裝python3.7出現ModuleNotFoundError: No module named ‘_ctypes’解決辦法
2020-07-26
python
安裝
python3.7
出現
modulenotfounderror
module
named
ctypes
解決辦法
Python
安裝swoole出現make報錯的緣由與解決方法
2019-12-09
安裝
swoole
出現
make
報錯
緣由
解決
方法
ubuntu16.04 安裝Teamviewer13出現依賴庫出錯的解決辦法
2019-12-04
ubuntu16.04
ubuntu
安裝
teamviewer13
teamviewer
出現
依賴
出錯
解決辦法
Ubuntu
使用yum安裝vim報出Error Summary的解決辦法
2021-01-12
yum
vim
Error Summary
Unix
Internal Server Error 解決辦法
2020-01-26
internal
server
error
解決辦法
error: ‘ovl_v1_fs_type’ undeclared解決辦法
2021-03-29
VMware-Tools
虛擬機
內核
嵌入式
虛擬機
更多相關搜索:
搜索
每日一句
每一个你不满意的现在,都有一个你没有努力的曾经。
最新文章
1.
「插件」Runner更新Pro版,幫助設計師遠離996
2.
錯誤 707 Could not load file or assembly ‘Newtonsoft.Json, Version=12.0.0.0, Culture=neutral, PublicKe
3.
Jenkins 2018 報告速覽,Kubernetes使用率躍升235%!
4.
TVI-Android技術篇之註解Annotation
5.
android studio啓動項目
6.
Android的ADIL
7.
Android卡頓的檢測及優化方法彙總(線下+線上)
8.
登錄註冊的業務邏輯流程梳理
9.
NDK(1)創建自己的C/C++文件
10.
小菜的系統框架界面設計-你的評估是我的決策
相关标签
解決辦法
7.3.7
make
安裝PHP
解決方法
現匯
error
總彙
彙總
IE bug 解決辦法
PHP
本站公眾號
歡迎關注本站公眾號,獲取更多信息