JavaShuo
欄目
標籤
Failure [INSTALL_FAILED_USER_RESTRICTED: Install canceled by user]‘; Code: ‘1‘錯誤解決 相關文章
原文信息 :
Failure [INSTALL_FAILED_USER_RESTRICTED: Install canceled by user]‘; Code: ‘1‘錯誤解決
標籤
failure
install
failed
user
restricted
canceled
code
錯誤
解決
全部
錯誤解決
python 錯誤解決
Python 解決錯誤
解決ssl錯誤
linux錯誤解決
canceled
failure
install
錯誤
user
Spring教程
NoSQL教程
MyBatis教程
更多相關搜索:
搜索
小米手機_adb安裝apk報錯」Failure [INSTALL_FAILED_USER_RESTRICTED: Install canceled by user]「
2019-12-01
小米
手機
adb
安裝
apk
報錯
failure
install
failed
user
restricted
canceled
Android
Installation failed with message INSTALL_FAILED_USER_RESTRICTED錯誤
2021-07-12
INSTALL_FAILED_USER_RESTRICTED錯誤
2019-12-04
install
failed
user
restricted
錯誤
安裝APK錯誤 Failure [INSTALL_CANCELED_BY_USER]
2020-12-25
Android
Recv failure: Connection reset by peer 報錯解決
2020-12-21
CentOS 7
CentOS
解決openpose msb6006 cmd.exe exit code 1錯誤
2020-12-23
adb命令安裝app報錯:Failure [INSTALL_FAILED_USER_RESTRICTED]
2020-12-21
InvalidOperationException was unhandled by user code
2021-01-11
解決 npm install錯誤
2021-07-12
npm
vue
npm install
【Mysql】錯誤Communications link failure解決方法
2020-12-21
MySQL
zmodem transfer canceled by remote side—SecureCRT報錯問題解決
2021-03-07
Linux運維
經驗分享
亂碼
linux
運維
SecureCRT
報錯解決
Linux
clang: error: exit code 1 錯誤詳解
2019-11-17
clang
error
exit
code
錯誤
詳解
eclipse Installation error: Unknown failure 錯誤解決方法
2019-12-11
eclipse
installation
error
unknown
failure
錯誤
解決
方法
Eclipse
adb: failed to install app-debug.apk: Failure [INSTALL_FAILED_ABORTED: User rejected permissions]
2019-11-05
adb
failed
install
app
debug.apk
debug
apk
failure
aborted
user
rejected
permissions
Android
解決:SpringBoot 錯誤:Caused by: org.yaml.snakeyaml.scanner.ScannerException
2020-09-11
解決
springboot
錯誤
caused
org.yaml.snakeyaml.scanner.scannerexception
org
yaml
snakeyaml
scanner
scannerexception
Spring
ubuntu錯誤解決E: Sub-process /usr/bin/dpkg returned an error code (1)
2020-11-24
html
post
spa
.net
code
orm
htm
進程
Ubuntu
解決RHadoop錯誤:PipeMapRed.waitOutputThreads(): subprocess failed with code 1
2021-01-03
Hadoop
network start (code=exited, status=1/FAILURE)
2020-12-20
系統網絡
怎樣解決 「sub process usr bin dpkg returned an error code 1」 錯誤
2021-01-19
apt-get install 錯誤
2019-11-22
apt
install
錯誤
運行maven install命令時出現錯誤(BUILD FAILURE)
2019-12-05
運行
maven
install
命令
出現
錯誤
build
failure
Maven
Fatal signal 11 (SIGSEGV) at 0xdeadbaad (code=1) 錯誤 解決方案(android-ndk)
2019-12-01
fatal
signal
sigsegv
0xdeadbaad
xdeadbaad
code
錯誤
解決
方案
android
ndk
Java
npm install錯誤
2021-07-12
python3 錯誤解決
2019-12-05
python3
python
錯誤
解決
Python
Caused by: org.apache.ibatis.reflection.ReflectionException 錯誤解決方法
2021-01-20
MyBatis
oracle 錯誤解決(1)
2020-12-28
Oracle
【Maven】maven工程錯誤之Failure to transfer根本解決法
2019-12-06
Maven
maven
工程
錯誤
failure
transfer
根本
解決
Maven
Exchange rollup package install failure event 1024
2020-01-19
exchange
rollup
package
install
failure
event
更多相關搜索:
搜索
每日一句
每一个你不满意的现在,都有一个你没有努力的曾经。
最新文章
1.
eclipse設置粘貼字符串自動轉義
2.
android客戶端學習-啓動模擬器異常Emulator: failed to initialize HAX: Invalid argument
3.
android.view.InflateException: class com.jpardogo.listbuddies.lib.views.ListBuddiesLayout問題
4.
MYSQL8.0數據庫恢復 MYSQL8.0ibd數據恢復 MYSQL8.0恢復數據庫
5.
你本是一個肉體,是什麼驅使你前行【1】
6.
2018.04.30
7.
2018.04.30
8.
你本是一個肉體,是什麼驅使你前行【3】
9.
你本是一個肉體,是什麼驅使你前行【2】
10.
【資訊】LocalBitcoins達到每週交易比特幣的7年低點
相关标签
錯誤解決
python 錯誤解決
Python 解決錯誤
解決ssl錯誤
linux錯誤解決
canceled
failure
install
錯誤
user
本站公眾號
歡迎關注本站公眾號,獲取更多信息