JavaShuo
欄目
標籤
weblogic報錯: OPatch failed with error code 73 相關文章
原文信息 :
weblogic報錯: OPatch failed with error code 73
全部
failed
opatch
weblogic
73%
error
錯報
報錯
code
failed......executable
MyBatis教程
PHP 7 新特性
Thymeleaf 教程
更多相關搜索:
搜索
OPatch failed with error code 104報錯
2019-12-07
opatch
failed
error
code
報錯
Oracle 10.2.0.5 opatch報錯
2020-08-05
oracle
10.2.0.5
opatch
報錯
Oracle
com.mongodb.MongoQueryException: Query failed with error code 13
2020-04-18
com.mongodb.mongoqueryexception
com
mongodb
mongoqueryexception
query
failed
error
code
MongoDB
Error: Request failed with status code 500的錯誤
2021-07-12
項目實戰
Error: Request failed with status code 404
2021-07-11
前端相關環境安裝
python setup.py egg_info failed with error code
2019-12-04
python
setup.py
setup
egg
info
failed
error
code
Python
Preverification failed with error code 1.
2020-12-25
pip3 install 報錯Command "python setup.py egg_info" failed with error code 1 in /tmp/...
2020-08-03
pip3
pip
install
報錯
command
python
setup.py
setup
egg
info
failed
error
code
tmp
Python
Python報錯: python setup.py egg_info" failed with error code 1
2020-08-03
python
報錯
setup.py
setup
egg
info
failed
error
code
Python
ubantu 16.04 編譯報錯 clang: error: linker command failed with exit code
2020-05-19
ubantu
16.04
編譯
報錯
clang
error
linker
command
failed
exit
code
.net C# Web Api 報錯 Error: Request failed with status code 404
2021-01-07
c#
C#
import tensorflow 報錯ImportError:DLL load failed with error code -1073741795
2020-05-10
import
tensorflow
報錯
importerror
dll
load
failed
error
code
Windows
andconda中pip安裝scrapy報錯failed with error code 1
2021-01-03
Python
XR: OpenVR Error! OpenVR failed initialization with error code VRInitError_Init_PathRegistryNotFound
2020-05-11
openvr
error
failed
initialization
code
vriniterror
init
pathregistrynotfound
Command "python setup.py egg_info" failed with error code 1
2019-12-05
command
python
setup.py
setup
egg
info
failed
error
code
Python
Mongodb報錯process failed, exited with error number
2021-01-19
html
數據庫
ide
htm
blog
get
class
MongoDB
XR: OpenVR Error! OpenVR failed initialization with error code VRInitError_Init_InterfaceNotFound:
2019-12-05
openvr
error
failed
initialization
code
vriniterror
init
interfacenotfound
【Error】vimplus安裝報錯 clang: error: linker command failed with exit code 1 (use -v to see invocation)
2020-05-19
Error
vimplus
安裝
報錯
clang
error
linker
command
failed
exit
code
use
invocation
get請求報錯Error in v-on handler (Promise/async): "Error: Request failed with status code 400"
2020-08-05
請求
報錯
error
handler
promise
async
request
failed
status
code
weblogic opatch安裝更新補丁,weblogic opatch打補丁
2021-01-05
html
web
oracle
app
spa
日誌
code
orm
xml
HTML
Error: java.lang.RuntimeException: PipeMapRed.waitOutputThreads(): subprocess failed with code 1
2020-07-14
error
java.lang.runtimeexception
java
lang
runtimeexception
pipemapred.waitoutputthreads
pipemapred
waitoutputthreads
subprocess
failed
code
Java
重啓網卡報Job for network.service failed because the control process exited with error code.。。 錯誤
2019-12-09
重啓
網卡
job
network.service
network
service
failed
control
process
exited
error
code
錯誤
網絡硬件
HTTP load failed (error code: -1009) / NSURLConnection finished with error - code -1009
2019-11-18
http
load
failed
error
code
nsurlconnection
finished
HTTP/TCP
weblogic opatch升級教程,weblogic opatch版本太低升級
2021-01-05
html
java
web
windows
oracle
this
spa
code
orm
HTML
Cordova Error: cmd: Command failed with exit code ENOENT
2019-12-07
cordova
error
cmd
command
failed
exit
code
enoent
Cordova
Error: cmd: Command failed with exit code ENOENT
2021-07-11
cordova
Cordova
Commit failed with error
2019-12-04
commit
failed
error
weblogic啓動報錯
2019-11-17
weblogic
啓動
報錯
錯誤( linker command failed with exit code 1)
2020-12-26
linker command faile
Oboe
靜態庫
路徑
網站開發
mongodb啓動報錯ERROR: child process failed, exited with error number 14
2019-11-12
mongodb
啓動
報錯
error
child
process
failed
exited
number
MongoDB
更多相關搜索:
搜索
每日一句
每一个你不满意的现在,都有一个你没有努力的曾经。
最新文章
1.
springboot在一個項目中啓動多個核心啓動類
2.
Spring Boot日誌-3 ------>SLF4J與別的框架整合
3.
SpringMVC-Maven(一)
4.
idea全局設置
5.
將word選擇題轉換成Excel
6.
myeclipse工程中library 和 web-inf下lib的區別
7.
Java入門——第一個Hello Word
8.
在chrome安裝vue devtools(以及安裝過程中出現的錯誤)
9.
Jacob線上部署及多項目部署問題處理
10.
1.初識nginx
相关标签
failed
opatch
weblogic
73%
error
錯報
報錯
code
failed......executable
本站公眾號
歡迎關注本站公眾號,獲取更多信息