JavaShuo
欄目
標籤
Hive: FAILED: SemanticException org.apache.hadoop.hive.ql.metadata.HiveException: java.lang.RuntimeE
時間 2021-01-08
欄目
Hadoop
简体版
原文
原文鏈接
Hive連接報錯: FAILED: SemanticException org.apache.hadoop.hive.ql.metadata.HiveException: java.lang.RuntimeException: Unable to instantiate org.apache.hadoop.hive.ql.metadata.SessionHiveMetaStoreClient
>>阅读原文<<
相關文章
1.
FAILED: SemanticException org.apache.hadoop.hive.ql.metadata.HiveException: java.lang.RuntimeExcepti
2.
報錯:SemanticException org.apache.hadoop.hive.ql.metadata.HiveException: java.lang.RuntimeException:Un
3.
在hive中執行sql語句:SemanticException org.apache.hadoop.hive.ql.metadata.HiveException:
4.
HIve報錯FAILED: SemanticException org.apache.hadoop.hive.ql.metadata.HiveException:Unable to instantia
5.
FAILED: SemanticException Line 1:17 Invalid path ''input'': No files matching path hdfs://localhost:
6.
hive插入數據失敗FAILED: SemanticException [Error 10293]: Unable to create temp file for insert values File
7.
FAILED: SemanticException Unable to determine if hdfs://tmaster:8020/user/root/words.db/test_t2 is e
8.
Phoenix報錯(5) org.apache.hadoop.hive.ql.metadata.HiveException
9.
hive函數 -- regexp_extract
10.
Hive SQL 使用不了union all : SemanticException Cartesian products are disabled for safety reasons
更多相關文章...
•
PHP mysqli_init() 函數
-
PHP參考手冊
•
PHP mysqli_kill() 函數
-
PHP參考手冊
•
TiDB 在摩拜單車在線數據業務的應用和實踐
相關標籤/搜索
org.apache.hadoop.hive.ql.metadata.hiveexception
semanticexception
failed
hive'@'%
hive
failed......executable
2.7.3+hive
hive+sqoop
hive+spark
hadoop+hive
Java
Apache
Hadoop
0
分享到微博
分享到微信
分享到QQ
每日一句
每一个你不满意的现在,都有一个你没有努力的曾经。
最新文章
1.
NLP《詞彙表示方法(六)ELMO》
2.
必看!RDS 數據庫入門一本通(附網盤鏈接)
3.
阿里雲1C2G虛擬機【99/年】羊毛黨集合啦!
4.
10秒鐘的Cat 6A網線認證儀_DSX2-5000 CH
5.
074《從零開始學Python網絡爬蟲》小記
6.
實例12--會動的地圖
7.
聽薦 | 「談笑風聲」,一次投資圈的嘗試
8.
阿里技術官手寫800多頁PDF總結《精通Java Web整合開發》
9.
設計模式之☞狀態模式實戰
本站公眾號
歡迎關注本站公眾號,獲取更多信息
相關文章
1.
FAILED: SemanticException org.apache.hadoop.hive.ql.metadata.HiveException: java.lang.RuntimeExcepti
2.
報錯:SemanticException org.apache.hadoop.hive.ql.metadata.HiveException: java.lang.RuntimeException:Un
3.
在hive中執行sql語句:SemanticException org.apache.hadoop.hive.ql.metadata.HiveException:
4.
HIve報錯FAILED: SemanticException org.apache.hadoop.hive.ql.metadata.HiveException:Unable to instantia
5.
FAILED: SemanticException Line 1:17 Invalid path ''input'': No files matching path hdfs://localhost:
6.
hive插入數據失敗FAILED: SemanticException [Error 10293]: Unable to create temp file for insert values File
7.
FAILED: SemanticException Unable to determine if hdfs://tmaster:8020/user/root/words.db/test_t2 is e
8.
Phoenix報錯(5) org.apache.hadoop.hive.ql.metadata.HiveException
9.
hive函數 -- regexp_extract
10.
Hive SQL 使用不了union all : SemanticException Cartesian products are disabled for safety reasons
>>更多相關文章<<