JavaShuo
欄目
標籤
/usr/bin/ld: cannot find -lltdl collect2: ld returned 1 exit status make: *** [sapi/cgi/php-cgi] Err
時間 2019-11-08
標籤
usr
bin
lltdl
collect2
collect
returned
exit
status
make
sapi
cgi
php
err
欄目
CGI
简体版
原文
原文鏈接
/usr/bin/ld: cannot find -lltdl
collect2: ld returned 1 exit status
make: *** [sapi/cgi/php-cgi] Error 1
php
解決辦法:
api
yum install *ltdl*
it
相關文章
1.
/usr/bin/ld: cannot find -lltdl collect2: ld returned 1 exit status make: *** [sapi/cgi/php-cgi] Err
2.
redis編譯安裝:make 的新錯誤--collect2: ld returned 1 exit status
3.
[Error] ld returned 1 exit status
4.
error: ld returned 1 exit status
5.
/usr/bin/ld:cannot open output file a.out: Permission denied collect2: ld returned 1 exit status
6.
make報錯:"/usr/bin/ld: cannot find -lXXX"
7.
error adding symbols: DSO missing from command line collect2: error: ld returned 1 exit status
8.
NS2:undefined reference to `xxx' collect2: error: ld returned 1 exit status
9.
QT錯誤:collect2:ld returned 1 exit status解決方法
10.
collect2: error: ld returned 1 exit status 問題解決
更多相關文章...
•
PHP exit() 函數
-
PHP參考手冊
•
ASP Status 屬性
-
ASP 教程
•
使用阿里雲OSS+CDN部署前端頁面與加速靜態資源
•
爲了進字節跳動,我精選了29道Java經典算法題,帶詳細講解
相關標籤/搜索
returned
collect2
lltdl
exit
status
err
make
ld..jobcontrol
core'&&cannot
CGI
PHP
PHP 7 新特性
Redis教程
Spring教程
0
分享到微博
分享到微信
分享到QQ
每日一句
每一个你不满意的现在,都有一个你没有努力的曾经。
最新文章
1.
gitlab新建分支後,android studio拿不到
2.
Android Wi-Fi 連接/斷開時間
3.
今日頭條面試題+答案,花點時間看看!
4.
小程序時間組件的開發
5.
小程序學習系列一
6.
[微信小程序] 微信小程序學習(一)——起步
7.
硬件
8.
C3盒模型以及他出現的必要性和圓角邊框/前端三
9.
DELL戴爾筆記本關閉觸摸板觸控板WIN10
10.
Java的long和double類型的賦值操作爲什麼不是原子性的?
本站公眾號
歡迎關注本站公眾號,獲取更多信息
相關文章
1.
/usr/bin/ld: cannot find -lltdl collect2: ld returned 1 exit status make: *** [sapi/cgi/php-cgi] Err
2.
redis編譯安裝:make 的新錯誤--collect2: ld returned 1 exit status
3.
[Error] ld returned 1 exit status
4.
error: ld returned 1 exit status
5.
/usr/bin/ld:cannot open output file a.out: Permission denied collect2: ld returned 1 exit status
6.
make報錯:"/usr/bin/ld: cannot find -lXXX"
7.
error adding symbols: DSO missing from command line collect2: error: ld returned 1 exit status
8.
NS2:undefined reference to `xxx' collect2: error: ld returned 1 exit status
9.
QT錯誤:collect2:ld returned 1 exit status解決方法
10.
collect2: error: ld returned 1 exit status 問題解決
>>更多相關文章<<