JavaShuo
欄目
標籤
Hadoop集羣,報java.lang.RuntimeException: PipeMapRed.waitOutputThreads(): subprocess failed with code 1
時間 2021-01-17
標籤
Hadoop
欄目
Hadoop
简体版
原文
原文鏈接
跑任務先生,在Hadoop的集羣,報 錯誤:了java.lang.RuntimeException:PipeMapRed.waitOutputThreads():子與代碼1未能 在org.apache.hadoop.streaming.PipeMapRed.waitOutputThreads(PipeMapRed.java:322) 在org.apache.hado
>>阅读原文<<
相關文章
1.
Error: java.lang.RuntimeException: PipeMapRed.waitOutputThreads(): subprocess failed with code 1
2.
解決RHadoop錯誤:PipeMapRed.waitOutputThreads(): subprocess failed with code 1
3.
Mapreduce運行任務出現Error: java.lang.RuntimeException: PipeMapRed.waitOutputThreads()
4.
Linker Command failed with exit code 1
5.
Preverification failed with error code 1.
6.
linker command failed with exit code 1
7.
TeXification failed with status code 1
8.
錯誤( linker command failed with exit code 1)
9.
Dispatcher initialization failed java.lang.RuntimeException: java.lang.RuntimeException
10.
Command /usr/bin/codesign failed with exit code 1
更多相關文章...
•
Swarm 集羣管理
-
Docker教程
•
ASP ServerVariables 集合
-
ASP 教程
•
☆技術問答集錦(13)Java Instrument原理
•
TiDB 在摩拜單車在線數據業務的應用和實踐
相關標籤/搜索
Hadoop集羣
subprocess
java.lang.runtimeexception
failed
羣集
集羣
1.hadoop
code
failed......executable
負載均衡
Java
Hadoop
MyBatis教程
PHP 7 新特性
NoSQL教程
0
分享到微博
分享到微信
分享到QQ
每日一句
每一个你不满意的现在,都有一个你没有努力的曾经。
最新文章
1.
1.2 Illustrator多文檔的幾種排列方式
2.
5.16--java數據類型轉換及雜記
3.
性能指標
4.
(1.2)工廠模式之工廠方法模式
5.
Java記錄 -42- Java Collection
6.
Java記錄 -42- Java Collection
7.
github使用
8.
Android學習筆記(五十):聲明、請求和檢查許可
9.
20180626
10.
服務擴容可能引入的負面問題及解決方法
本站公眾號
歡迎關注本站公眾號,獲取更多信息
相關文章
1.
Error: java.lang.RuntimeException: PipeMapRed.waitOutputThreads(): subprocess failed with code 1
2.
解決RHadoop錯誤:PipeMapRed.waitOutputThreads(): subprocess failed with code 1
3.
Mapreduce運行任務出現Error: java.lang.RuntimeException: PipeMapRed.waitOutputThreads()
4.
Linker Command failed with exit code 1
5.
Preverification failed with error code 1.
6.
linker command failed with exit code 1
7.
TeXification failed with status code 1
8.
錯誤( linker command failed with exit code 1)
9.
Dispatcher initialization failed java.lang.RuntimeException: java.lang.RuntimeException
10.
Command /usr/bin/codesign failed with exit code 1
>>更多相關文章<<