JavaShuo
欄目
標籤
基於Arduino的ESP8266模塊燒錄問題解決彙總 error: espcomm_open failed error: espcomm_upload_mem failed
時間 2021-01-08
標籤
arduino
简体版
原文
原文鏈接
前言 小車做的有點枯燥了,可能暫時停一段時間。正好在淘寶撿垃圾淘的ESP8266和其它板子到了。打算試試Arduino然後再學習一波stm32充充電,在B站(衆所周知B站是學習的地方)跟着別人的教程準備先體驗體驗ESP8266然後着手做一波類似AWTRIX的小玩意兒。結果第一天就翻車,小車閃爍的例子燒不進去。 圖便宜買的ESP8266 ps:帶了個micro口還送了條usb線,省了TTL轉USB模
>>阅读原文<<
相關文章
1.
Arduino編程ESP8266下載報錯錯誤:warning: espcomm_sync failed error: espcomm_open failed error: espcomm_uplo
2.
Esp8266燒寫錯誤解決辦法 error: failed reading byte warning: espcomm_send_command: can't receive slip
3.
【解決問題】failed: java.lang.RuntimeException: org.openqa.selenium.WebDriverException: Unexpected error l
4.
React Native error: bundling failed: Error: Unable to resolve module `AccessibilityInfo` from...問題解決
5.
Commit failed with error
6.
關於JMH運行ERROR: transport error 202: connect failed: Connection refused ERROR解決
7.
Java-Error【解決】-Compilation failed: internal java compiler error
8.
關於OSD::mkfs: ObjectStore::mkfs failed with error (5) Input/output error問題的解決
9.
Error -27796: Failed to connect to server問題解決記錄
10.
mongodb child process failed, exited with error number彙總
更多相關文章...
•
Redis樂觀鎖解決高併發搶紅包的問題
-
紅包項目實戰
•
ADO Error 對象
-
ADO 教程
•
RxJava操作符(五)Error Handling
•
☆基於Java Instrument的Agent實現
相關標籤/搜索
failed
error
failed......executable
問題彙總
error#2036
cv2.error
target...error
event&error
error#2044
問題解決
NoSQL教程
Spring教程
MyBatis教程
設計模式
委託模式
0
分享到微博
分享到微信
分享到QQ
每日一句
每一个你不满意的现在,都有一个你没有努力的曾经。
最新文章
1.
[最佳實踐]瞭解 Eolinker 如何助力遠程辦公
2.
katalon studio 安裝教程
3.
精通hibernate(harness hibernate oreilly)中的一個」錯誤「
4.
ECharts立體圓柱型
5.
零拷貝總結
6.
6 傳輸層
7.
Github協作圖想
8.
Cannot load 32-bit SWT libraries on 64-bit JVM
9.
IntelliJ IDEA 找其歷史版本
10.
Unity3D(二)遊戲對象及組件
本站公眾號
歡迎關注本站公眾號,獲取更多信息
相關文章
1.
Arduino編程ESP8266下載報錯錯誤:warning: espcomm_sync failed error: espcomm_open failed error: espcomm_uplo
2.
Esp8266燒寫錯誤解決辦法 error: failed reading byte warning: espcomm_send_command: can't receive slip
3.
【解決問題】failed: java.lang.RuntimeException: org.openqa.selenium.WebDriverException: Unexpected error l
4.
React Native error: bundling failed: Error: Unable to resolve module `AccessibilityInfo` from...問題解決
5.
Commit failed with error
6.
關於JMH運行ERROR: transport error 202: connect failed: Connection refused ERROR解決
7.
Java-Error【解決】-Compilation failed: internal java compiler error
8.
關於OSD::mkfs: ObjectStore::mkfs failed with error (5) Input/output error問題的解決
9.
Error -27796: Failed to connect to server問題解決記錄
10.
mongodb child process failed, exited with error number彙總
>>更多相關文章<<