JavaShuo
欄目
標籤
HTTP Error 500.31 - ANCM Failed to Find Native Dependencies
時間 2021-07-12
標籤
服務器
欄目
HTTP/TCP
简体版
原文
原文鏈接
在服務器上部署.net core2.2項目 我已經在服務器安裝了dotnet-runtime-3.1.8-win-x64 和dotnet-hosting-3.1.8-win 但部署2.2項目遇到500.13錯誤 HTTP Error 500.31 - ANCM Failed to Find Native Dependencies Common solutions to this issue: Th
>>阅读原文<<
相關文章
1.
Error installing mysql2: ERROR: Failed to build gem native extension
2.
repackage failed: Unable to find main class
3.
build QuteLauncher Error: Failed to find Build Tools revision 24.0.1
4.
Error: Failed to find Build Tools revision 24.0.2
5.
1837170582. Error: INSTALL_FAILED_NO_MATCHING_ABIS: Failed to extract native libraries, res=-113
6.
[ERROR] Failed to execute goal on project treasure_core_service: Could not resolve dependencies for
7.
[ERROR] Failed to execute goal on project jdong: Could not resolve dependencies for project jdong:ja
8.
Error: error getting chaincode bytes: failed to calculate dependencies報錯解決辦法
9.
ERROR: Error installing mysql2: ERROR: Failed to build gem native extension [@Ubuntu 15.04]
10.
ERROR: Error installing cocoapods: ERROR: Failed to build gem native extension.-09-16
更多相關文章...
•
ADO Error 對象
-
ADO 教程
•
HTTP狀態碼
-
HTTP 教程
•
RxJava操作符(五)Error Handling
•
使用阿里雲OSS+CDN部署前端頁面與加速靜態資源
相關標籤/搜索
dependencies
ancm
failed
error
native
failed......executable
http
to@8
to......443
error#2036
HTTP/TCP
HTTP 教程
0
分享到微博
分享到微信
分享到QQ
每日一句
每一个你不满意的现在,都有一个你没有努力的曾经。
最新文章
1.
正確理解商業智能 BI 的價值所在
2.
解決梯度消失梯度爆炸強力推薦的一個算法-----LSTM(長短時記憶神經網絡)
3.
解決梯度消失梯度爆炸強力推薦的一個算法-----GRU(門控循環神經⽹絡)
4.
HDU4565
5.
算概率投硬幣
6.
密碼算法特性
7.
DICOMRT-DiTools:clouddicom源碼解析(1)
8.
HDU-6128
9.
計算機網絡知識點詳解(持續更新...)
10.
hods2896(AC自動機)
本站公眾號
歡迎關注本站公眾號,獲取更多信息
相關文章
1.
Error installing mysql2: ERROR: Failed to build gem native extension
2.
repackage failed: Unable to find main class
3.
build QuteLauncher Error: Failed to find Build Tools revision 24.0.1
4.
Error: Failed to find Build Tools revision 24.0.2
5.
1837170582. Error: INSTALL_FAILED_NO_MATCHING_ABIS: Failed to extract native libraries, res=-113
6.
[ERROR] Failed to execute goal on project treasure_core_service: Could not resolve dependencies for
7.
[ERROR] Failed to execute goal on project jdong: Could not resolve dependencies for project jdong:ja
8.
Error: error getting chaincode bytes: failed to calculate dependencies報錯解決辦法
9.
ERROR: Error installing mysql2: ERROR: Failed to build gem native extension [@Ubuntu 15.04]
10.
ERROR: Error installing cocoapods: ERROR: Failed to build gem native extension.-09-16
>>更多相關文章<<