JavaShuo
欄目
標籤
python3.8 pycharm安裝PIL錯誤 failed with error code 1
時間 2021-01-03
標籤
python
pip
深度學習
機器學習
數據挖掘
欄目
Python
简体版
原文
原文鏈接
python版本3.8 pycharm版本2019.3.4 failed with error code 1 百度和google搜遍了。答案五花八門沒解決問題 解決方法: 1.把PIP版本升級到最新 2.setuptools版本升級到最新 3.安裝wheel 升級 --->點擊需要升級的package---->點小三角 如需進python開發微---信交流-羣 加我 安裝PIL錯誤如下
>>阅读原文<<
相關文章
1.
Error: Request failed with status code 500的錯誤
2.
錯誤( linker command failed with exit code 1)
3.
Preverification failed with error code 1.
4.
andconda中pip安裝scrapy報錯failed with error code 1
5.
linker command failed with exit code 1 錯誤
6.
pip安裝包出現 Command "python setup.py egg_info" failed with error code 1 錯誤
7.
安裝庫提示Command "python setup.py egg_info" failed with error code 1 in C:\Users\.....錯誤
8.
clang++.exe: error: linker command failed with exit code 1 錯誤解決方法
9.
解決XCode編譯錯誤clang: error: linker command failed with exit code 1
10.
安裝psycopg2 ERROR: Command "python setup.py egg_info" failed with error code 1 in
更多相關文章...
•
錯誤處理
-
RUST 教程
•
PHP PDO 錯誤與錯誤處理
-
PHP參考手冊
•
Composer 安裝與使用
•
IntelliJ IDEA安裝代碼格式化插件
相關標籤/搜索
PyCharm的安裝
failed
python3.8
python3.8+pycharm+pyqt
錯誤
pil
error
1.pycharm
code
安裝
Python
PHP 7 新特性
Hibernate教程
Redis教程
0
分享到微博
分享到微信
分享到QQ
每日一句
每一个你不满意的现在,都有一个你没有努力的曾经。
最新文章
1.
《給初學者的Windows Vista的補遺手冊》之074
2.
CentoOS7.5下編譯suricata-5.0.3及簡單使用
3.
快速搭建網站
4.
使用u^2net打造屬於自己的remove-the-background
5.
3.1.7 spark體系之分佈式計算-scala編程-scala中模式匹配match
6.
小Demo大知識-通過控制Button移動來學習Android座標
7.
maya檢查和刪除多重面
8.
Java大數據:大數據開發必須掌握的四種數據庫
9.
強烈推薦幾款IDEA插件,12款小白神器
10.
數字孿生體技術白皮書 附下載地址
本站公眾號
歡迎關注本站公眾號,獲取更多信息
相關文章
1.
Error: Request failed with status code 500的錯誤
2.
錯誤( linker command failed with exit code 1)
3.
Preverification failed with error code 1.
4.
andconda中pip安裝scrapy報錯failed with error code 1
5.
linker command failed with exit code 1 錯誤
6.
pip安裝包出現 Command "python setup.py egg_info" failed with error code 1 錯誤
7.
安裝庫提示Command "python setup.py egg_info" failed with error code 1 in C:\Users\.....錯誤
8.
clang++.exe: error: linker command failed with exit code 1 錯誤解決方法
9.
解決XCode編譯錯誤clang: error: linker command failed with exit code 1
10.
安裝psycopg2 ERROR: Command "python setup.py egg_info" failed with error code 1 in
>>更多相關文章<<